BDBM50508945 CHEMBL4448503
SMILES C[C@@H]1CCCCN(C)c2cc(Nc3cc4CCC(=O)N(C)c4c(O1)c3)n1ncc(C#N)c1n2
InChI Key InChIKey=NREYYLHVEKNZSU-OAHLLOKOSA-N
Data  1 IC50
  Tab Delimited (TSV)   2D SDfile   Computed 3D by Vconf -m prep SDfile
Find this compound or compounds like it in BindingDB:
Activity Spreadsheet -- Enzyme Inhibition Constant Data from BindingDB
Found 1 hit for monomerid = 50508945
TargetB-cell lymphoma 6 protein(Homo sapiens)
Astrazeneca
Curated by ChEMBL
LigandPNGBDBM50508945(CHEMBL4448503)
Affinity DataIC50:  25nM. Assay description: Inhibition of Bcl6 (unknown origin) by TR-FRET assay
Ligand InfoPC cidPC sid
In DepthDetails ArticlePubMed