BDBM50511915 CHEMBL4517829
SMILES COc1ccc2ccc(OCC(=O)NS(=O)(=O)c3ccc(N)cc3OC)cc2c1
InChI Key InChIKey=JLIDTTQDLTURSD-UHFFFAOYSA-N
Data  1 IC50  1 EC50
  Tab Delimited (TSV)   2D SDfile   Computed 3D by Vconf -m prep SDfile
Find this compound or compounds like it in BindingDB:
Activity Spreadsheet -- Enzyme Inhibition Constant Data from BindingDB
Found 2 hits for monomerid = 50511915
TargetRap guanine nucleotide exchange factor 3(Homo sapiens (Human))
University Of Texas Medical Branch
Curated by ChEMBL
LigandPNGBDBM50511915(CHEMBL4517829)
Affinity DataEC50:  5.00E+3nM. Assay description: Activation of recombinant EPAC1 (149 to 881 residues) (unknown origin) assessed as stimulation of dissociation of fluorescent MANT-GDP from recombina...
Ligand InfoPC cidPC sid
In DepthDetails ArticlePubMed
TargetRap guanine nucleotide exchange factor 3(Homo sapiens (Human))
University Of Texas Medical Branch
Curated by ChEMBL
LigandPNGBDBM50511915(CHEMBL4517829)
Affinity DataIC50:  900nM. Assay description: Binding affinity to GST-tagged recombinant EPAC1 CNBD (169 to 318 residues) (unknown origin) expressed in Escherichia coli BL21 Star (DE3) incubated ...
Ligand InfoPC cidPC sid
In DepthDetails ArticlePubMed