BDBM50511921 CHEMBL4544587
SMILES CCC(=O)Nc1cccc(c1)-c1c[nH]cc1CN(C)CCN
InChI Key InChIKey=ZXTYIIDDTFQCGV-UHFFFAOYSA-N
Data  7 IC50
PDB links: 1 PDB ID matches this monomer.
  Tab Delimited (TSV)   2D SDfile   Computed 3D by Vconf -m prep SDfile
Find this compound or compounds like it in BindingDB:
Activity Spreadsheet -- Enzyme Inhibition Constant Data from BindingDB
Found 7 hits for monomerid = 50511921
TargetProtein arginine N-methyltransferase 6(Homo sapiens (Human))
Icahn School Of Medicine At Mount Sinai
Curated by ChEMBL
LigandPNGBDBM50511921(CHEMBL4544587)
Affinity DataIC50:  28nM. Assay description: Inhibition of human PRMT6 using [3H]SAM as donor and [3H]methylated biotin-labeled peptide as substrate by scintillation proximity assay
Ligand InfoPC cidPC sidPDB
TargetProtein arginine N-methyltransferase 8(Homo sapiens (Human))
Icahn School Of Medicine At Mount Sinai
Curated by ChEMBL
LigandPNGBDBM50511921(CHEMBL4544587)
Affinity DataIC50:  130nM. Assay description: Inhibition of human PRMT8 using [3H]SAM as donor and [3H]methylated biotin-labeled peptide as substrate by scintillation proximity assay
Ligand InfoPC cidPC sidPDB
In DepthDetails ArticlePubMed
TargetProtein arginine N-methyltransferase 6(Homo sapiens (Human))
Icahn School Of Medicine At Mount Sinai
Curated by ChEMBL
LigandPNGBDBM50511921(CHEMBL4544587)
Affinity DataIC50:  28nM. Assay description: Inhibition of human PRMT6 using [3H]SAM as donor and [3H]methylated biotin-labeled peptide as substrate by scintillation proximity assay
Ligand InfoPC cidPC sidPDB
TargetProtein arginine N-methyltransferase 1(Homo sapiens)
Icahn School Of Medicine At Mount Sinai
Curated by ChEMBL
LigandPNGBDBM50511921(CHEMBL4544587)
Affinity DataIC50:  6.70E+3nM. Assay description: Inhibition of PRMT1 in human MCF7 cells assessed as reduction in H4R3me2a levels incubated for 2 days by fluorescence based assay
Ligand InfoPC cidPC sidPDB
In DepthDetails ArticlePubMed
TargetHistone-arginine methyltransferase CARM1(Homo sapiens (Human))
Icahn School Of Medicine At Mount Sinai
Curated by ChEMBL
LigandPNGBDBM50511921(CHEMBL4544587)
Affinity DataIC50:  2.00E+3nM. Assay description: Inhibition of human PRMT4 using [3H]SAM as donor and [3H]methylated biotin-labeled peptide as substrate by scintillation proximity assay
Ligand InfoPC cidPC sidPDB
In DepthDetails ArticlePubMed
TargetProtein arginine N-methyltransferase 3(Homo sapiens)
Icahn School Of Medicine At Mount Sinai
Curated by ChEMBL
LigandPNGBDBM50511921(CHEMBL4544587)
Affinity DataIC50:  1.50E+4nM. Assay description: Inhibition of human PRMT3 using [3H]SAM as donor and [3H]methylated biotin-labeled peptide as substrate by scintillation proximity assay
Ligand InfoPC cidPC sidPDB
In DepthDetails ArticlePubMed
TargetProtein arginine N-methyltransferase 1(Homo sapiens)
Icahn School Of Medicine At Mount Sinai
Curated by ChEMBL
LigandPNGBDBM50511921(CHEMBL4544587)
Affinity DataIC50:  170nM. Assay description: Inhibition of human PRMT1 using [3H]SAM as donor and [3H]methylated biotin-labeled peptide as substrate by scintillation proximity assay
Ligand InfoPC cidPC sidPDB
In DepthDetails ArticlePubMed