BDBM50512139 CHEMBL4458595
SMILES Clc1ccccc1-n1cc(nn1)-c1cccc(NS(=O)(=O)c2c[nH]c(=O)[nH]c2=O)c1
InChI Key InChIKey=YDABBHDQJDZGJQ-UHFFFAOYSA-N
Data  1 IC50
  Tab Delimited (TSV)   2D SDfile   Computed 3D by Vconf -m prep SDfile
Find this compound or compounds like it in BindingDB:
Activity Spreadsheet -- Enzyme Inhibition Constant Data from BindingDB
Found 1 hit for monomerid = 50512139
TargetPolyunsaturated fatty acid lipoxygenase ALOX15B(Rattus norvegicus)
China Medical University
Curated by ChEMBL
LigandPNGBDBM50512139(CHEMBL4458595)
Affinity DataIC50:  1.28E+3nM. Assay description: Inhibition of human thymidylate synthase using dUMP as substrate by spectrophotometric method
Ligand InfoPC cidPC sid
In DepthDetails ArticlePubMed