BDBM50512141 Alimta::CHEBI:63722::LY-231514 DISODIUM SALT::LY231514 DISODIUM SALT::Pemetrexed disodium::Pemetrexed disodium heptahydrate::Pemetrexed sodium hydrate::Pemetrexed sodium salt
SMILES [Na+].[Na+].Nc1nc2[nH]cc(CCc3ccc(cc3)C(=O)N[C@@H](CCC([O-])=O)C([O-])=O)c2c(=O)[nH]1
InChI Key InChIKey=IMJSLXRZWAYDAR-GXKRWWSZSA-L
Data  1 IC50
  Tab Delimited (TSV)   2D SDfile   Computed 3D by Vconf -m prep SDfile
Find this compound or compounds like it in BindingDB:
Activity Spreadsheet -- Enzyme Inhibition Constant Data from BindingDB
Found 1 hit for monomerid = 50512141
TargetPolyunsaturated fatty acid lipoxygenase ALOX15B(Rattus norvegicus)
China Medical University
Curated by ChEMBL
LigandPNGBDBM50512141(Alimta | CHEBI:63722 | LY-231514 DISODIUM SALT | L...)
Affinity DataIC50:  2.04E+3nM. Assay description: Inhibition of human thymidylate synthase using dUMP as substrate by spectrophotometric method
In DepthDetails ArticlePubMed