BDBM50512146 CHEMBL4459098
SMILES Clc1cccc(c1)-n1cc(nn1)-c1ccc(NS(=O)(=O)c2c[nH]c(=O)[nH]c2=O)cc1
InChI Key InChIKey=MPKQQDVTHRCHHE-UHFFFAOYSA-N
Data  1 IC50
  Tab Delimited (TSV)   2D SDfile   Computed 3D by Vconf -m prep SDfile
Find this compound or compounds like it in BindingDB:
Activity Spreadsheet -- Enzyme Inhibition Constant Data from BindingDB
Found 1 hit for monomerid = 50512146
TargetPolyunsaturated fatty acid lipoxygenase ALOX15B(Rattus norvegicus)
China Medical University
Curated by ChEMBL
LigandPNGBDBM50512146(CHEMBL4459098)
Affinity DataIC50:  1.58E+3nM. Assay description: Inhibition of human thymidylate synthase using dUMP as substrate by spectrophotometric method
Ligand InfoPC cidPC sid
In DepthDetails ArticlePubMed