BDBM50512172 CHEMBL4453677
SMILES CCCCCCS(=O)(=O)c1nccc(n1)-n1ccnn1
InChI Key InChIKey=PHWGGCNWMMXSFK-UHFFFAOYSA-N
Data  2 IC50
  Tab Delimited (TSV)   2D SDfile   Computed 3D by Vconf -m prep SDfile
Find this compound or compounds like it in BindingDB:
Activity Spreadsheet -- Enzyme Inhibition Constant Data from BindingDB
Found 2 hits for monomerid = 50512172
Target3-oxoacyl-ACP synthase(Pseudomonas aeruginosa)
Mashhad University Of Medical Sciences
Curated by ChEMBL
LigandPNGBDBM50512172(CHEMBL4453677)
Affinity DataIC50:  1.70E+3nM. Assay description: Inhibition of Pseudomonas aeruginosa PqsD
Ligand InfoPC cidPC sid
In DepthDetails ArticlePubMed
TargetVirulence factor transcriptional regulator MvfR(Pseudomonas aeruginosa PA14)
Mashhad University Of Medical Sciences
Curated by ChEMBL
LigandPNGBDBM50512172(CHEMBL4453677)
Affinity DataIC50:  5.00E+4nM. Assay description: Inhibition of Pseudomonas aeruginosa PqsR
Ligand InfoPC cidPC sid
In DepthDetails ArticlePubMed