BDBM505126 US11066409, Compound I-0091
SMILES COc1ccc(Nc2nc(=O)c(C=C)c3CCC(c4cc(F)cc(F)c4)n23)c(C)n1
InChI Key InChIKey=NHJCXUBXLMCFOR-UHFFFAOYSA-N
Data  1 IC50
  Tab Delimited (TSV)   2D SDfile   Computed 3D by Vconf -m prep SDfile
Find this compound or compounds like it in BindingDB:
Activity Spreadsheet -- Enzyme Inhibition Constant Data from BindingDB
Found 1 hit for monomerid = 505126
TargetP2X purinoceptor 7(Homo sapiens (Human))
Shionogi
US Patent
LigandPNGBDBM505126(US11066409, Compound I-0091)
Affinity DataIC50:  17nM. Assay description: Evaluation of a human P2X7 receptor inhibitory activity Stably expressing cell line (1321N1 cell transfected with the human P2X7 receptor gene (GenBa...
Ligand InfoPC cidPC sid
In DepthDetails US Patent