BDBM50513931 CHEMBL4444446
SMILES [H][C@]12O[C@H](CO)[C@@H](O)[C@@H](F)[C@@]1([H])N=C(NC)S2
InChI Key InChIKey=KFTTUHTWIAVGRH-IECVIRLLSA-N
Data  2 KI  1 EC50
  Tab Delimited (TSV)   2D SDfile   Computed 3D by Vconf -m prep SDfile
Find this compound or compounds like it in BindingDB:
Activity Spreadsheet -- Enzyme Inhibition Constant Data from BindingDB
Found 3 hits for monomerid = 50513931
TargetProtein O-GlcNAcase(Homo sapiens (Human))
Merck
Curated by ChEMBL
LigandPNGBDBM50513931(CHEMBL4444446)
Affinity DataKi:  0.530nM. Assay description: Inhibition of recombinant human OGA
Ligand InfoPC cidPC sid
In DepthDetails ArticlePubMed
TargetBeta-hexosaminidase subunit beta(Homo sapiens (Human))
Merck
Curated by ChEMBL
LigandPNGBDBM50513931(CHEMBL4444446)
Affinity DataKi: >1.00E+4nM. Assay description: Inhibition of human beta hexosaminidase assessed as inhibitory constant using 4-methylumbelliferyl N-acetyl-beta-D-glucosaminide dihydrate as substra...
Ligand InfoPC cidPC sid
In DepthDetails ArticlePubMed
TargetProtein O-GlcNAcase(Rattus norvegicus)
Merck
Curated by ChEMBL
LigandPNGBDBM50513931(CHEMBL4444446)
Affinity DataEC50:  11nM. Assay description: Inhibition of OGA in rat PC12 cells assessed as OGlcNAcylated protein level incubated for 24 hrs by ELISA
Ligand InfoPC cidPC sid
In DepthDetails ArticlePubMed