BDBM50515321 CHEMBL4543232
SMILES O=C(N1CCc2ccccc2C1)c1cncc(c1)N1CC2CC(C1)N2
InChI Key InChIKey=VIKPJXVYULNEFB-UHFFFAOYSA-N
Data  3 KI
  Tab Delimited (TSV)   2D SDfile   Computed 3D by Vconf -m prep SDfile
Find this compound or compounds like it in BindingDB:
Activity Spreadsheet -- Enzyme Inhibition Constant Data from BindingDB
Found 3 hits for monomerid = 50515321
TargetNeuronal acetylcholine receptor subunit alpha-4/beta-2(Rattus norvegicus (Rat))
Universit£
Curated by ChEMBL
LigandPNGBDBM50515321(CHEMBL4543232)
Affinity DataKi:  0.0310nM. Assay description: Displacement of [3H]epibatidine from alpha4beta2 nAChR in rat cerebral cortex membrane
Ligand InfoPC cidPC sid
In DepthDetails ArticlePubMed
TargetNeuronal acetylcholine receptor subunit alpha-3/beta-4(Homo sapiens (Human))
Universit£
Curated by ChEMBL
LigandPNGBDBM50515321(CHEMBL4543232)
Affinity DataKi:  21nM. Assay description: Displacement of [3H]epibatidine from human alpha3beta4 nAChR transfected in HEK243 cell membrane
Ligand InfoPC cidPC sid
In DepthDetails ArticlePubMed
TargetNeuronal acetylcholine receptor subunit alpha-7(Rattus norvegicus (Rat))
Universit£
Curated by ChEMBL
LigandPNGBDBM50515321(CHEMBL4543232)
Affinity DataKi:  1.00E+3nM. Assay description: Displacement of [125I]alpha-bungarotoxin from alpha7nAChR in rat hippocampus membrane
Ligand InfoPC cidPC sid
In DepthDetails ArticlePubMed