BDBM505155 US11066409, Compound I-0013
SMILES COc1cc(C)c(Nc2nc(=O)cc3CCC(c4ccc(F)c(Cl)c4)n23)cc1OC
InChI Key InChIKey=NJEDKWZWXUDHHJ-UHFFFAOYSA-N
Data  1 IC50
  Tab Delimited (TSV)   2D SDfile   Computed 3D by Vconf -m prep SDfile
Find this compound or compounds like it in BindingDB:
Activity Spreadsheet -- Enzyme Inhibition Constant Data from BindingDB
Found 1 hit for monomerid = 505155
TargetP2X purinoceptor 7(Homo sapiens (Human))
Shionogi
US Patent
LigandPNGBDBM505155(US11066409, Compound I-0013)
Affinity DataIC50: <10nM. Assay description: Evaluation of a human P2X7 receptor inhibitory activity Stably expressing cell line (1321N1 cell transfected with the human P2X7 receptor gene (GenBa...
Ligand InfoPC cidPC sid
In DepthDetails US Patent