BDBM50518255 CHEMBL4443353
SMILES NCCCC[C@@H]1NC(=O)[C@H](Cc2ccc(O)cc2)NC(=O)[C@@H]2CSSC[C@H](NC(=O)[C@H](CC(N)=O)NC(=O)[C@@H]3CCCN3C(=O)[C@@H]3CCCN3C(=O)[C@H](CCCCN)NC(=O)[C@H](CO)NC1=O)C(=O)N[C@@H](Cc1ccccc1)C(=O)N1CCC[C@H]1C(=O)N[C@@H](CC(O)=O)C(=O)NCC(=O)N[C@@H](CCCNC(N)=N)C(=O)N2
InChI Key InChIKey=UJAPWTVZDUAEPB-JUNIVEESSA-N
Data  1 KI
  Tab Delimited (TSV)   2D SDfile   Computed 3D by Vconf -m prep SDfile
Find this compound or compounds like it in BindingDB:
Activity Spreadsheet -- Enzyme Inhibition Constant Data from BindingDB
Found 1 hit for monomerid = 50518255
TargetPlasminogen(Homo sapiens (Human))
The University Of Queensland
Curated by ChEMBL
LigandPNGBDBM50518255(CHEMBL4443353)
Affinity DataKi:  0.660nM. Assay description: Inhibition of human plasmin using Ac-RM(O2)YR-pNA as substrate after 30 mins
Ligand InfoPC cidPC sid
In DepthDetails ArticlePubMed