BDBM50518878 CHEMBL4464588
SMILES COc1ccc(C[C@H](NC(=O)[C@H](C)CS)B(O)O)cc1
InChI Key InChIKey=PQADIRATANJZTA-SKDRFNHKSA-N
Data  1 KI
  Tab Delimited (TSV)   2D SDfile   Computed 3D by Vconf -m prep SDfile
Find this compound or compounds like it in BindingDB:
Activity Spreadsheet -- Enzyme Inhibition Constant Data from BindingDB
Found 1 hit for monomerid = 50518878
TargetBeta-lactamase TEM(Escherichia coli)
Sichuan University
Curated by ChEMBL
LigandPNGBDBM50518878(CHEMBL4464588)
Affinity DataKi:  3.36E+3nM. Assay description: Inhibition of bacterial N-terminal His-tagged TEV protease site linked TEM-1 (24 to 286 amino acids) expressed in Escherichia coli Transetta (DE3) pr...
Ligand InfoPC cidPC sid
In DepthDetails ArticlePubMed