BDBM50518892 CHEMBL4453017
SMILES C[C@H](CS)C(=O)N[C@H](B(O)O)c1ccc(F)cc1
InChI Key InChIKey=CDDJMEDWZMPIRW-XCBNKYQSSA-N
Data  1 KI
PDB links: 1 PDB ID matches this monomer.
  Tab Delimited (TSV)   2D SDfile   Computed 3D by Vconf -m prep SDfile
Find this compound or compounds like it in BindingDB:
Activity Spreadsheet -- Enzyme Inhibition Constant Data from BindingDB
Found 1 hit for monomerid = 50518892
TargetBeta-lactamase TEM(Escherichia coli)
Sichuan University
Curated by ChEMBL
LigandPNGBDBM50518892(CHEMBL4453017)
Affinity DataKi:  1.42E+4nM. Assay description: Inhibition of bacterial N-terminal His-tagged TEV protease site linked TEM-1 (24 to 286 amino acids) expressed in Escherichia coli Transetta (DE3) pr...
Ligand InfoPC cidPC sidPDB
In DepthDetails ArticlePubMed