BDBM50520234 CHEMBL4538610
SMILES COc1cc(Nc2nc(ncc2F)N2C[C@H](C)N[C@H](C)C2)ccc1NC(=O)c1ccc(s1)C1=CCCC1
InChI Key InChIKey=VJFKSXHAFLCLLP-CALCHBBNSA-N
Data  1 IC50  1 Kd
  Tab Delimited (TSV)   2D SDfile   Computed 3D by Vconf -m prep SDfile
Find this compound or compounds like it in BindingDB:
Activity Spreadsheet -- Enzyme Inhibition Constant Data from BindingDB
Found 2 hits for monomerid = 50520234
TargetB-cell lymphoma 6 protein(Homo sapiens)
East China Normal University And Shanghai Fengxian District Central Hospital Joint Center For Translational Medicine
Curated by ChEMBL
LigandPNGBDBM50520234(CHEMBL4538610)
Affinity DataKd:  366nM. Assay description: Binding affinity to recombinant human C-terminal GST-tagged BCL6 BTB domain C8Q/C67R/C84N triple mutant expressed in Escherichia coli BL21 (DE3) cell...
In DepthDetails ArticlePubMed
TargetB-cell lymphoma 6 protein(Homo sapiens)
East China Normal University And Shanghai Fengxian District Central Hospital Joint Center For Translational Medicine
Curated by ChEMBL
LigandPNGBDBM50520234(CHEMBL4538610)
Affinity DataIC50:  470nM. Assay description: Inhibition of recombinant human C-terminal GST-tagged BCL6 BTB domain C8Q/C67R/C84N triple mutant expressed in Escherichia coli BL21 (DE3) cells asse...
In DepthDetails ArticlePubMed