BDBM50526870 CHEMBL4303594
SMILES Cn1ncnc1COc1nn2c(nnc2cc1C1CCC1)-c1c(F)cccc1F
InChI Key InChIKey=GOIFCXRIFSYPFG-UHFFFAOYSA-N
Data  3 KI
  Tab Delimited (TSV)   2D SDfile   Computed 3D by Vconf -m prep SDfile
Find this compound or compounds like it in BindingDB:
Activity Spreadsheet -- Enzyme Inhibition Constant Data from BindingDB
Found 3 hits for monomerid = 50526870
TargetGamma-aminobutyric acid receptor subunit alpha-3/beta-3/gamma-2(Homo sapiens (Human))
University Of Sussex
Curated by ChEMBL
LigandPNGBDBM50526870(CHEMBL4303594)
Affinity DataKi:  0.210nM. Assay description: Displacement of [3H]-flumazenil from human GABAA alpha3beta3gamma2 expressed in Ltk cells
In DepthDetails ArticlePubMed
TargetGamma-aminobutyric acid receptor subunit alpha-1/beta-3/gamma-2(Homo sapiens (Human))
University Of Sussex
Curated by ChEMBL
LigandPNGBDBM50526870(CHEMBL4303594)
Affinity DataKi:  0.220nM. Assay description: Displacement of [3H]-flumazenil from human GABAA alpha1beta3gamma2 expressed in Ltk cells
Target InfoGoogleScholar
In DepthDetails ArticlePubMed
TargetGABA-A receptor; alpha-5/beta-3/gamma-2(Homo sapiens (Human))
University Of Sussex
Curated by ChEMBL
LigandPNGBDBM50526870(CHEMBL4303594)
Affinity DataKi:  0.230nM. Assay description: Displacement of [3H]-flumazenil from human GABAA alpha5beta3gamma2 expressed in Ltk cells
In DepthDetails ArticlePubMed