BDBM50527799 CHEBI:60704::CHEMBL2387748
SMILES OC(=O)\C=C\c1cccc(c1)C(F)(F)F
InChI Key InChIKey=KSBWHDDGWSYETA-SNAWJCMRSA-N
Data  2 IC50
PDB links: 1 PDB ID matches this monomer.
  Tab Delimited (TSV)   2D SDfile   Computed 3D by Vconf -m prep SDfile
Find this compound or compounds like it in BindingDB:
Activity Spreadsheet -- Enzyme Inhibition Constant Data from BindingDB
Found 2 hits for monomerid = 50527799
TargetEnoyl-[acyl-carrier-protein] reductase [NADH](Mycobacterium tuberculosis (strain ATCC 25618 / H3...)
Vrije Universiteit Amsterdam
Curated by ChEMBL
LigandPNGBDBM50527799(CHEBI:60704 | CHEMBL2387748)
Affinity DataIC50: >2.00E+6nM. Assay description: Inhibition of recombinant hexaHis-SUMO tagged Mycobacterium tuberculosis InhA expressed in Escherichia coli BL21 (DE3) incubated for 10 mins by color...
TargetEnoyl-[acyl-carrier-protein] reductase [NADH](Mycobacterium tuberculosis (strain ATCC 25618 / H3...)
Vrije Universiteit Amsterdam
Curated by ChEMBL
LigandPNGBDBM50527799(CHEBI:60704 | CHEMBL2387748)
Affinity DataIC50: >1.00E+6nM. Assay description: Inhibition of hexahistidine-SUMO tagged Mycobacterium tuberculosis InhA expressed in Escherichia coli BL21(DE3) at preincubated for 10 mins with NADH...