BDBM50531524 CHEMBL4551727
SMILES NS(=O)(=O)c1ccc(cc1)-c1noc(n1)-c1cccs1
InChI Key InChIKey=CKHCRDBKFLEBMZ-UHFFFAOYSA-N
Data  4 KI
  Tab Delimited (TSV)   2D SDfile   Computed 3D by Vconf -m prep SDfile
Find this compound or compounds like it in BindingDB:
Activity Spreadsheet -- Enzyme Inhibition Constant Data from BindingDB
Found 4 hits for monomerid = 50531524
TargetCarbonic anhydrase 9(Homo sapiens (Human))
Saint Petersburg State University
Curated by ChEMBL
LigandPNGBDBM50531524(CHEMBL4551727)
Affinity DataKi:  0.360nM. Assay description: Inhibition of human carbonic anhydrase 9 assessed as reduction in CO2 hydration after 15 mins by phenol red staining-based stopped flow assay
Ligand InfoPC cidPC sid
In DepthDetails ArticlePubMed
TargetCarbonic anhydrase 2(Homo sapiens (Human))
Saint Petersburg State University
Curated by ChEMBL
LigandPNGBDBM50531524(CHEMBL4551727)
Affinity DataKi:  0.390nM. Assay description: Inhibition of human carbonic anhydrase 2 assessed as reduction in CO2 hydration after 15 mins by phenol red staining-based stopped flow assay
Ligand InfoPC cidPC sid
In DepthDetails ArticlePubMed
TargetCarbonic anhydrase 1(Homo sapiens (Human))
Saint Petersburg State University
Curated by ChEMBL
LigandPNGBDBM50531524(CHEMBL4551727)
Affinity DataKi:  7.90nM. Assay description: Inhibition of human carbonic anhydrase 1 assessed as reduction in CO2 hydration after 15 mins by phenol red staining-based stopped flow assay
Ligand InfoPC cidPC sid
In DepthDetails ArticlePubMed
TargetCarbonic anhydrase 12(Homo sapiens (Human))
Saint Petersburg State University
Curated by ChEMBL
LigandPNGBDBM50531524(CHEMBL4551727)
Affinity DataKi:  8.30nM. Assay description: Inhibition of human carbonic anhydrase 12 assessed as reduction in CO2 hydration after 15 mins by phenol red staining-based stopped flow assay
Ligand InfoPC cidPC sid
In DepthDetails ArticlePubMed