BDBM50531924 CHEMBL4464577
SMILES CC[C@H](C)[C@@H]1NC(=O)[C@H](Cc2ccc(O)cc2)NC(=O)[C@H](CCCNC(N)=N)NC(=O)[C@H](CO)NC(=O)[C@H](Cc2ccc(O)cc2)NC(=O)[C@H](C)NC(=O)[C@@H]2CCCN2C(=O)[C@@H](N)CSSC[C@H](NC(=O)CNC1=O)C(O)=O
InChI Key InChIKey=CCJVUWLRIGMAMZ-SZLYCLTDSA-N
Data  14 KI  5 IC50  2 Kd
  Tab Delimited (TSV)   2D SDfile   Computed 3D by Vconf -m prep SDfile
Find this compound or compounds like it in BindingDB:
Activity Spreadsheet -- Enzyme Inhibition Constant Data from BindingDB
Found 21 hits for monomerid = 50531924
TargetUrokinase-type plasminogen activator(Mus musculus (Mouse))
Chinese Academy Of Sciences
Curated by ChEMBL
LigandPNGBDBM50531924(CHEMBL4464577)
Affinity DataKi:  6.80nM. Assay description: Inhibition of mouse uPA preincubated for 15 mins followed by chromogenic substrate addition
Ligand InfoPC cidPC sid
In DepthDetails ArticlePubMed
TargetUrokinase-type plasminogen activator(Mus musculus (Mouse))
Chinese Academy Of Sciences
Curated by ChEMBL
LigandPNGBDBM50531924(CHEMBL4464577)
Affinity DataKi:  15nM. Assay description: Inhibition of mouse uPA serine protease domain preincubated for 15 mins followed by chromogenic substrate addition
Ligand InfoPC cidPC sid
In DepthDetails ArticlePubMed
TargetUrokinase-type plasminogen activator(Homo sapiens (Human))
Chinese Academy Of Sciences
Curated by ChEMBL
LigandPNGBDBM50531924(CHEMBL4464577)
Affinity DataKi:  340nM. Assay description: Inhibition of human uPA preincubated for 15 mins followed by chromogenic substrate addition
Ligand InfoPC cidPC sid
In DepthDetails ArticlePubMed
TargetVitamin K-dependent protein C(Homo sapiens (Human))
Chinese Academy Of Sciences
Curated by ChEMBL
LigandPNGBDBM50531924(CHEMBL4464577)
Affinity DataKi: >2.50E+4nM. Assay description: Inhibition of human activated protein C preincubated for 15 mins followed by chromogenic substrate addition
Ligand InfoPC cidPC sid
In DepthDetails ArticlePubMed
TargetCoagulation factor XI(Homo sapiens (Human))
Chinese Academy Of Sciences
Curated by ChEMBL
LigandPNGBDBM50531924(CHEMBL4464577)
Affinity DataKi: >2.50E+4nM. Assay description: Inhibition of human factor 11a preincubated for 15 mins followed by chromogenic substrate addition
Ligand InfoPC cidPC sid
In DepthDetails ArticlePubMed
TargetProthrombin(Mus musculus)
Chinese Academy Of Sciences
Curated by ChEMBL
LigandPNGBDBM50531924(CHEMBL4464577)
Affinity DataKi: >2.50E+4nM. Assay description: Inhibition of mouse thrombin preincubated for 15 mins followed by chromogenic substrate addition
Ligand InfoPC cidPC sid
In DepthDetails ArticlePubMed
TargetPlasma kallikrein(Homo sapiens (Human))
Chinese Academy Of Sciences
Curated by ChEMBL
LigandPNGBDBM50531924(CHEMBL4464577)
Affinity DataKi: >2.50E+4nM. Assay description: Inhibition of human plasma kallikrein preincubated for 15 mins followed by chromogenic substrate addition
Ligand InfoPC cidPC sid
In DepthDetails ArticlePubMed
TargetPlasminogen(Homo sapiens (Human))
Chinese Academy Of Sciences
Curated by ChEMBL
LigandPNGBDBM50531924(CHEMBL4464577)
Affinity DataKi: >2.50E+4nM. Assay description: Inhibition of human plasmin preincubated for 15 mins followed by chromogenic substrate addition
Ligand InfoPC cidPC sid
In DepthDetails ArticlePubMed
TargetPlasminogen(Mus musculus)
Chinese Academy Of Sciences
Curated by ChEMBL
LigandPNGBDBM50531924(CHEMBL4464577)
Affinity DataKi: >2.50E+4nM. Assay description: Inhibition of mouse plasmin preincubated for 15 mins followed by chromogenic substrate addition
Ligand InfoPC cidPC sid
In DepthDetails ArticlePubMed
TargetPlasma kallikrein(Mus musculus)
Chinese Academy Of Sciences
Curated by ChEMBL
LigandPNGBDBM50531924(CHEMBL4464577)
Affinity DataKi: >2.50E+4nM. Assay description: Inhibition of mouse plasma kallikrein preincubated for 15 mins followed by chromogenic substrate addition
Ligand InfoPC cidPC sid
In DepthDetails ArticlePubMed
TargetTissue-type plasminogen activator(Homo sapiens (Human))
Chinese Academy Of Sciences
Curated by ChEMBL
LigandPNGBDBM50531924(CHEMBL4464577)
Affinity DataKi: >2.50E+4nM. Assay description: Inhibition of human tissue-type plasminogen activator preincubated for 15 mins followed by chromogenic substrate addition
Ligand InfoPC cidPC sid
In DepthDetails ArticlePubMed
TargetProthrombin(Homo sapiens (Human))
Chinese Academy Of Sciences
Curated by ChEMBL
LigandPNGBDBM50531924(CHEMBL4464577)
Affinity DataKi: >2.50E+4nM. Assay description: Inhibition of human thrombin preincubated for 15 mins followed by chromogenic substrate addition
Ligand InfoPC cidPC sid
In DepthDetails ArticlePubMed
TargetSuppressor of tumorigenicity 14 protein(Homo sapiens (Human))
Chinese Academy Of Sciences
Curated by ChEMBL
LigandPNGBDBM50531924(CHEMBL4464577)
Affinity DataKi: >2.50E+4nM. Assay description: Inhibition of human matriptase preincubated for 15 mins followed by chromogenic substrate addition
Ligand InfoPC cidPC sid
In DepthDetails ArticlePubMed
TargetTissue-type plasminogen activator(Mus musculus)
Chinese Academy Of Sciences
Curated by ChEMBL
LigandPNGBDBM50531924(CHEMBL4464577)
Affinity DataKi: >2.50E+4nM. Assay description: Inhibition of mouse tissue-type plasminogen activator preincubated for 15 mins followed by chromogenic substrate addition
Ligand InfoPC cidPC sid
In DepthDetails ArticlePubMed
TargetUrokinase-type plasminogen activator(Mus musculus (Mouse))
Chinese Academy Of Sciences
Curated by ChEMBL
LigandPNGBDBM50531924(CHEMBL4464577)
Affinity DataKd:  2.40nM. Assay description: Binding affinity to mouse uPA by SPR assay
Ligand InfoPC cidPC sid
In DepthDetails ArticlePubMed
TargetUrokinase-type plasminogen activator(Mus musculus (Mouse))
Chinese Academy Of Sciences
Curated by ChEMBL
LigandPNGBDBM50531924(CHEMBL4464577)
Affinity DataKd:  11nM. Assay description: Binding affinity to mouse uPA expressed in HEK2936E cells by ITC assay
Ligand InfoPC cidPC sid
In DepthDetails ArticlePubMed
TargetUrokinase-type plasminogen activator(Mus musculus (Mouse))
Chinese Academy Of Sciences
Curated by ChEMBL
LigandPNGBDBM50531924(CHEMBL4464577)
Affinity DataIC50:  71nM. Assay description: Inhibition of uPA in presence of 75% mouse serum measured at 24 hrs
Ligand InfoPC cidPC sid
In DepthDetails ArticlePubMed
TargetUrokinase-type plasminogen activator(Mus musculus (Mouse))
Chinese Academy Of Sciences
Curated by ChEMBL
LigandPNGBDBM50531924(CHEMBL4464577)
Affinity DataIC50:  12nM. Assay description: Inhibition of uPA in presence of 75% mouse serum measured at 2 hrs
Ligand InfoPC cidPC sid
In DepthDetails ArticlePubMed
TargetUrokinase-type plasminogen activator(Mus musculus (Mouse))
Chinese Academy Of Sciences
Curated by ChEMBL
LigandPNGBDBM50531924(CHEMBL4464577)
Affinity DataIC50:  10nM. Assay description: Inhibition of uPA in presence of 75% mouse serum measured immediately
Ligand InfoPC cidPC sid
In DepthDetails ArticlePubMed
TargetUrokinase-type plasminogen activator(Mus musculus (Mouse))
Chinese Academy Of Sciences
Curated by ChEMBL
LigandPNGBDBM50531924(CHEMBL4464577)
Affinity DataIC50:  11nM. Assay description: Inhibition of uPA in presence of 75% mouse serum measured at 8 hrs
Ligand InfoPC cidPC sid
In DepthDetails ArticlePubMed
TargetUrokinase-type plasminogen activator(Mus musculus (Mouse))
Chinese Academy Of Sciences
Curated by ChEMBL
LigandPNGBDBM50531924(CHEMBL4464577)
Affinity DataIC50:  3.28E+3nM. Assay description: Inhibition of the intrinsic peri-cellular uPA in mouse CT26 cells assessed as reduction in cell invasion measured every hour by transwell assay
Ligand InfoPC cidPC sid
In DepthDetails ArticlePubMed