BDBM505354 US11066413, Compound 23
SMILES Nc1nc2C(Cc3ccccc3OC(F)(F)F)OC(=O)c2c(n1)-c1ccco1
InChI Key InChIKey=ZKQSJODMWLNBDR-UHFFFAOYSA-N
Data  1 IC50
  Tab Delimited (TSV)   2D SDfile   Computed 3D by Vconf -m prep SDfile
Find this compound or compounds like it in BindingDB:
Activity Spreadsheet -- Enzyme Inhibition Constant Data from BindingDB
Found 1 hit for monomerid = 505354
TargetAdenosine receptor A2a(Homo sapiens (Human))
Guangzhou Maxinovel Pharmaceuticals
US Patent
LigandPNGBDBM505354(US11066413, Compound 23)
Affinity DataIC50:  3.90nM. Assay description: 1. Preparation of the reagents1) Detection buffer: 50 mM Tris-HCl pH 7.4, 10 mM MgCl2, 1 mM EDTA, 1 μg/mL Adenosine Deaminase, and stored at 4° ...
Ligand InfoPC cidPC sid
In DepthDetails US Patent