BDBM561988 BDBM50537615::US11396496, Compound A6
SMILES COc1ccc(cc1)S(=O)(=O)Nc1cnc(N(CC(O)=O)S(=O)(=O)c2ccc(OC)cc2)c2ccccc12
InChI Key InChIKey=DWJKYIQRADXANA-UHFFFAOYSA-N
Data  2 IC50
  Tab Delimited (TSV)   2D SDfile   Computed 3D by Vconf -m prep SDfile
Find this compound or compounds like it in BindingDB:
Activity Spreadsheet -- Enzyme Inhibition Constant Data from BindingDB
Found 2 hits for monomerid = 561988
TargetKelch-like ECH-associated protein 1/Nuclear factor erythroid 2-related factor 2(Homo sapiens (Human))
The Board Of Trustees Of The University Of Illinois
US Patent
LigandPNGBDBM561988(BDBM50537615 | US11396496, Compound A6)
Affinity DataIC50:  212nM. Assay description: The IC50 of the compounds for inhibiting the interaction of a fluorescent NRF2 peptide and the Kelch domain of KEAP1 was determined using fluorescenc...
Ligand InfoPC cidPC sid
In DepthDetails US Patent
TargetNuclear factor erythroid 2-related factor 2(Homo sapiens (Human))
TBA
Curated by ChEMBL
LigandPNGBDBM561988(BDBM50537615 | US11396496, Compound A6)
Affinity DataIC50:  230nM. Assay description: Concentration required to inhibit the phosphorylation of a 14-residue fragment of phospholipase C gamma 1 by Epidermal growth factor receptor from A4...
Ligand InfoPC cidPC sid
In DepthDetails ArticlePubMed