BDBM50539266 CHEMBL4634443
SMILES ONC(=O)c1ccc(COc2ccc(CNC(=O)[C@@H]3CCC(=O)N3Cc3ccccc3)cc2)cc1
InChI Key InChIKey=RBHBHBHVVOZJLM-DEOSSOPVSA-N
Data  1 IC50
  Tab Delimited (TSV)   2D SDfile   Computed 3D by Vconf -m prep SDfile
Find this compound or compounds like it in BindingDB:
Activity Spreadsheet -- Enzyme Inhibition Constant Data from BindingDB
Found 1 hit for monomerid = 50539266
TargetAtaxin-2(Mus musculus)
National And Kapodistrian University Of Athens
Curated by ChEMBL
LigandPNGBDBM50539266(CHEMBL4634443)
Affinity DataIC50:  700nM. Assay description: Inhibition of recombinant mouse N-terminal polyHis-tagged ATX-beta (Ser49 to Ile862 residues) expressed in HEK293 cells assessed as reduction in clea...
Ligand InfoPC cidPC sid
In DepthDetails ArticlePubMed