BDBM50540313 CHEMBL4644208
SMILES CCO[C@H]1CCN(Cc2c(C)cc(C)c3[nH]ccc23)[C@@H](C1)c1ccc(cc1)C(O)=O
InChI Key
Data  3 IC50
  Tab Delimited (TSV)   2D SDfile   Computed 3D by Vconf -m prep SDfile
Find this compound or compounds like it in BindingDB:
Activity Spreadsheet -- Enzyme Inhibition Constant Data from BindingDB
Found 3 hits for monomerid = 50540313
TargetComplement factor B(Homo sapiens (Human))
Novartis Institutes For Biomedical Research
Curated by ChEMBL
LigandPNGBDBM50540313(CHEMBL4644208)
Affinity DataIC50:  18nM. Assay description: Inhibition of human serine protease factor B by TR-FRET based competition binding assay
Ligand InfoPC cidPC sid
In DepthDetails ArticlePubMed
TargetComplement factor B(Mus musculus)
Novartis Institutes For Biomedical Research
Curated by ChEMBL
LigandPNGBDBM50540313(CHEMBL4644208)
Affinity DataIC50:  120nM. Assay description: Inhibition of serine protease factor B in 50% mouse serum assessed as reduction in C3b deposition pre-incubated for 15 mins before activated zymosan ...
Ligand InfoPC cidPC sid
In DepthDetails ArticlePubMed
TargetComplement factor B(Homo sapiens (Human))
Novartis Institutes For Biomedical Research
Curated by ChEMBL
LigandPNGBDBM50540313(CHEMBL4644208)
Affinity DataIC50:  110nM. Assay description: Inhibition of serine protease factor B in 50% human whole blood assessed as reduction in alternative pathway-mediated membrane attack complex formati...
Ligand InfoPC cidPC sid
In DepthDetails ArticlePubMed