BDBM50540356 CHEMBL4632464::US11427590, Entry 17
SMILES CC(=O)N[C@@H]1CCN(C1)c1cc(C)nn2c(c(C)nc12)-c1ccc(OC(F)(F)F)cc1
InChI Key InChIKey=YYWLUWNEFUZAMV-MRXNPFEDSA-N
Data  2 IC50
  Tab Delimited (TSV)   2D SDfile   Computed 3D by Vconf -m prep SDfile
Find this compound or compounds like it in BindingDB:
Activity Spreadsheet -- Enzyme Inhibition Constant Data from BindingDB
Found 2 hits for monomerid = 50540356
TargetSphingomyelin phosphodiesterase 3(Homo sapiens)
The Johns Hopkins University
US Patent
LigandPNGBDBM50540356(CHEMBL4632464 | US11427590, Entry 17)
Affinity DataIC50:  200nM. Assay description: The fluorescence based assay to monitor the activity of human nSMase2 in the presence or absence of potential inhibitors has been described recently....
Ligand InfoPC cidPC sid
In DepthDetails US Patent
TargetSphingomyelin phosphodiesterase 3(Homo sapiens)
The Johns Hopkins University
US Patent
LigandPNGBDBM50540356(CHEMBL4632464 | US11427590, Entry 17)
Affinity DataIC50:  200nM. Assay description: Inhibition of human recombinant full-length nSMase expressed in HEK293 cells using sphingomyelin as substrate measured after 1 hr by alkaline phospha...
Ligand InfoPC cidPC sid
In DepthDetails ArticlePubMed