BDBM50540378 CHEMBL4634085::US11427590, Entry 22
SMILES COc1ccc(cc1OC)-c1c(C)nc2c(cc(C)nn12)N1CC[C@H](C1)NS(=O)(=O)c1ccc(C)cc1
InChI Key InChIKey=GTYPZLIRZDMVNG-OAQYLSRUSA-N
Data  2 IC50
  Tab Delimited (TSV)   2D SDfile   Computed 3D by Vconf -m prep SDfile
Find this compound or compounds like it in BindingDB:
Activity Spreadsheet -- Enzyme Inhibition Constant Data from BindingDB
Found 2 hits for monomerid = 50540378
TargetSphingomyelin phosphodiesterase 3(Homo sapiens)
The Johns Hopkins University
US Patent
LigandPNGBDBM50540378(CHEMBL4634085 | US11427590, Entry 22)
Affinity DataIC50:  90nM. Assay description: The fluorescence based assay to monitor the activity of human nSMase2 in the presence or absence of potential inhibitors has been described recently....
Ligand InfoPC cidPC sid
In DepthDetails US Patent
TargetSphingomyelin phosphodiesterase 3(Homo sapiens)
The Johns Hopkins University
US Patent
LigandPNGBDBM50540378(CHEMBL4634085 | US11427590, Entry 22)
Affinity DataIC50:  90nM. Assay description: Inhibition of human recombinant full-length nSMase expressed in HEK293 cells using sphingomyelin as substrate measured after 1 hr by alkaline phospha...
Ligand InfoPC cidPC sid
In DepthDetails ArticlePubMed