BDBM50541828 CHEMBL4633877
SMILES CC(C)C[C@H](N(C)C(=O)[C@H](CCCCN)NC(=O)[C@H](CO)NC(C)=O)C(N)=O
InChI Key InChIKey=SOBDNYSDLXIUJP-KKUMJFAQSA-N
Data  1 IC50
  Tab Delimited (TSV)   2D SDfile   Computed 3D by Vconf -m prep SDfile
Find this compound or compounds like it in BindingDB:
Activity Spreadsheet -- Enzyme Inhibition Constant Data from BindingDB
Found 1 hit for monomerid = 50541828
TargetThrombospondin-1(Homo sapiens)
Southern Research Institute
Curated by ChEMBL
LigandPNGBDBM50541828(CHEMBL4633877)
Affinity DataIC50:  2.20nM. Assay description: Inhibition of TSP1 in human myeloma cells assessed reduction in TGFbeta activity incubated for 1 hr by ELISA
Ligand InfoPC cidPC sid
In DepthDetails ArticlePubMed