BDBM50541839 CHEMBL4649293
SMILES CC(=O)N[C@@H](CCCN)C(=O)NC(C)(C)C(N)=O
InChI Key InChIKey=XBCYIRCOIWJBTN-QMMMGPOBSA-N
Data  1 IC50
  Tab Delimited (TSV)   2D SDfile   Computed 3D by Vconf -m prep SDfile
Find this compound or compounds like it in BindingDB:
Activity Spreadsheet -- Enzyme Inhibition Constant Data from BindingDB
Found 1 hit for monomerid = 50541839
TargetThrombospondin-1(Homo sapiens)
Southern Research Institute
Curated by ChEMBL
LigandPNGBDBM50541839(CHEMBL4649293)
Affinity DataIC50:  7.60nM. Assay description: Inhibition of TSP1 in human myeloma cells assessed reduction in TGFbeta activity incubated for 1 hr by ELISA
Ligand InfoPC cidPC sid
In DepthDetails ArticlePubMed