BDBM50547187 CHEMBL4791887
SMILES CN1CCN(CC1)c1ccc(cc1)-c1c([nH]c2ccc(Cl)cc12)C(N)=O
InChI Key InChIKey=KHIMTRSDQCUUCZ-UHFFFAOYSA-N
Data  1 IC50
  Tab Delimited (TSV)   2D SDfile   Computed 3D by Vconf -m prep SDfile
Find this compound or compounds like it in BindingDB:
Activity Spreadsheet -- Enzyme Inhibition Constant Data from BindingDB
Found 1 hit for monomerid = 50547187
TargetMicrotubule-associated protein 2(Homo sapiens (Human))
Glaxosmithkline
Curated by ChEMBL
LigandPNGBDBM50547187(CHEMBL4791887)
Affinity DataIC50:  25nM. Assay description: Inhibition of MetAP2 (unknown origin)
Ligand InfoPC cidPC sid
In DepthDetails ArticlePubMed