BDBM50547191 CHEMBL4746468
SMILES CC(C)Oc1cc(ccc1-c1c([nH]c2cc(F)c(F)cc12)C(N)=O)N1CCNCC1
InChI Key InChIKey=VLTSNEYKDGRFDU-UHFFFAOYSA-N
Data  2 IC50
PDB links: 2 PDB IDs match this monomer.
  Tab Delimited (TSV)   2D SDfile   Computed 3D by Vconf -m prep SDfile
Find this compound or compounds like it in BindingDB:
Activity Spreadsheet -- Enzyme Inhibition Constant Data from BindingDB
Found 2 hits for monomerid = 50547191
TargetMethionine aminopeptidase 2(Mus musculus (Mouse))
Glaxosmithkline
Curated by ChEMBL
LigandPNGBDBM50547191(CHEMBL4746468)
Affinity DataIC50:  40nM. Assay description: Inhibition of MetAP2 in mouse B cells assessed as reduction in IgG secretion
Ligand InfoPC cidPC sidPDB
TargetMicrotubule-associated protein 2(Homo sapiens (Human))
Glaxosmithkline
Curated by ChEMBL
LigandPNGBDBM50547191(CHEMBL4746468)
Affinity DataIC50:  2nM. Assay description: Inhibition of MetAP2 (unknown origin)
Ligand InfoPC cidPC sidPDB
In DepthDetails ArticlePubMed