BDBM50549234 CHEMBL4798326
SMILES O\N=C\C1=C(CCC1)/C=C/c1ccc(F)cc1
InChI Key InChIKey=RBQGYYOPSOFJDR-LVVPDBGKSA-N
Data  1 IC50
  Tab Delimited (TSV)   2D SDfile   Computed 3D by Vconf -m prep SDfile
Find this compound or compounds like it in BindingDB:
Activity Spreadsheet -- Enzyme Inhibition Constant Data from BindingDB
Found 1 hit for monomerid = 50549234
TargetFibroblast growth factor 23(Homo sapiens)
Tennessee Technological University
Curated by ChEMBL
LigandPNGBDBM50549234(CHEMBL4798326)
Affinity DataIC50:  370nM. Assay description: Inhibition of FGF23 (unknown origin)-mediated activation of FGFR/alpha-Klotho transfected in HEK293T cells cotransfected with ERK luciferase reporter...
Ligand InfoKEGGPC cidPC sid
In DepthDetails ArticlePubMed