BDBM50549459 CHEMBL4764916
SMILES Cn1c(Cc2ccc3CCOc3c2)nc2cc(O[C@H]3CC[C@](F)(CC3)c3nnn[nH]3)ccc12
InChI Key
Data  2 IC50
  Tab Delimited (TSV)   2D SDfile   Computed 3D by Vconf -m prep SDfile
Find this compound or compounds like it in BindingDB:
Activity Spreadsheet -- Enzyme Inhibition Constant Data from BindingDB
Found 2 hits for monomerid = 50549459
TargetLong-chain-fatty-acid--CoA ligase 1(Homo sapiens)
Shionogi Pharmaceutical Research Center
Curated by ChEMBL
LigandPNGBDBM50549459(CHEMBL4764916)
Affinity DataIC50:  3nM. Assay description: Inhibition of recombinant human ACSL1 assessed as reduction in acetyl-coA prodution incubated for 90 mins in presence of Coenzyme A, ATP and MgCl2 by...
Ligand InfoPC cidPC sid
In DepthDetails ArticlePubMed
TargetLong-chain-fatty-acid--CoA ligase 1(Mus musculus)
Shionogi Pharmaceutical Research Center
Curated by ChEMBL
LigandPNGBDBM50549459(CHEMBL4764916)
Affinity DataIC50:  15nM. Assay description: Inhibition of recombinant mouse ACSL1 assessed as reduction in acetyl-coA prodution incubated for 90 mins in presence of Coenzyme A, ATP and MgCl2 by...
Ligand InfoPC cidPC sid
In DepthDetails ArticlePubMed