BDBM50550123 CHEMBL4755113
SMILES [H][C@@]12CC[C@](O)(C(=O)CO)[C@@]1(C)C[C@H](O)[C@@]1([H])[C@@]2([H])CCC2=Cc3nn(cc3C[C@]12C)-c1ccc(C)cc1
InChI Key InChIKey=TVXPHENRMXIYLT-VVFCHSPPSA-N
Data  1 Kd
  Tab Delimited (TSV)   2D SDfile   Computed 3D by Vconf -m prep SDfile
Find this compound or compounds like it in BindingDB:
Activity Spreadsheet -- Enzyme Inhibition Constant Data from BindingDB
Found 1 hit for monomerid = 50550123
TargetGlucocorticoid receptor(Homo sapiens (Human))
University Of Iowa
Curated by ChEMBL
LigandPNGBDBM50550123(CHEMBL4755113)
Affinity DataKd:  883nM. Assay description: Induction of translocation of human glucocorticoid receptor expressed in HEK293T cells transduced with lentiviral vector expressing H2B-mCherry and G...
Ligand InfoPC cidPC sid
In DepthDetails ArticlePubMed