BDBM50551313 CHEMBL4745764
SMILES [H][C@]12Oc3c4c(C[C@@]5([H])N(C)CC[C@]14C51C[C@]([H])([C@@](C)(O)CCC)[C@]2(O)C=C1)ccc3O
InChI Key InChIKey=KBKSVRDSTJRCDJ-OSHQJYHLSA-N
Data  3 KI
  Tab Delimited (TSV)   2D SDfile   Computed 3D by Vconf -m prep SDfile
Find this compound or compounds like it in BindingDB:
Activity Spreadsheet -- Enzyme Inhibition Constant Data from BindingDB
Found 3 hits for monomerid = 50551313
TargetMu-type opioid receptor(Rattus norvegicus (rat))
University Of Szeged
Curated by ChEMBL
LigandPNGBDBM50551313(CHEMBL4745764)
Affinity DataKi:  0.0136nM. Assay description: Displacement of [3H]DAMGO from MOR in Wistar rat brain membranes measured after 45 mins by scintillation counting method
Ligand InfoPC cidPC sid
In DepthDetails ArticlePubMed
TargetKappa-type opioid receptor(Cavia porcellus (domestic guinea pig))
University Of Szeged
Curated by ChEMBL
LigandPNGBDBM50551313(CHEMBL4745764)
Affinity DataKi:  0.796nM. Assay description: Displacement of [3H]HS665 from KOR in guinea pig brain membranes measured after 45 mins by scintillation counting method
Ligand InfoPC cidPC sid
In DepthDetails ArticlePubMed
TargetDelta-type opioid receptor(Rattus norvegicus (rat))
University Of Szeged
Curated by ChEMBL
LigandPNGBDBM50551313(CHEMBL4745764)
Affinity DataKi:  2.40nM. Assay description: Displacement of [3H]Ile5'6-deltorphin II from DOR in Wistar rat brain membranes measured after 45 mins by scintillation counting method
Ligand InfoPC cidPC sid
In DepthDetails ArticlePubMed