BDBM50551407 CHEMBL4786932
SMILES [H][C@]12[C@H](OC3(C(=O)c4ccccc4C3=O)[C@@]1([H])C(=O)N(C2=O)c1ccc(C)cc1F)c1ccc(C)cc1
InChI Key InChIKey=OVOAMVPAQDURDT-DNVJHFABSA-N
Data  1 EC50
  Tab Delimited (TSV)   2D SDfile   Computed 3D by Vconf -m prep SDfile
Find this compound or compounds like it in BindingDB:
Activity Spreadsheet -- Enzyme Inhibition Constant Data from BindingDB
Found 1 hit for monomerid = 50551407
TargetAdenylate cyclase type 2(Homo sapiens (Human))
Chinese Academy Of Sciences
Curated by ChEMBL
LigandPNGBDBM50551407(CHEMBL4786932)
Affinity DataEC50:  770nM. Assay description: Agonist activity at recombinant human AC2 expressed in HEK293 cells assessed as increase in cAMP level measured after 30 mins by LANCE Ultra cAMP Det...
Ligand InfoPC cidPC sid
In DepthDetails ArticlePubMed