BDBM505530 (3aR,6aR)-5-cyano-N-(5- phenyl-pyridin-2-yl) hexahydropyrrolo[3,4-b] pyrrole-1(2H)-carboxamide::US11066365, Example 202::US11390584, Example 202
SMILES O=C(Nc1ccc(cn1)-c1ccccc1)N1CC[C@@H]2CN(C[C@H]12)C#N
InChI Key InChIKey=XUNOMIYWTZFYRV-SJORKVTESA-N
Data  2 IC50
  Tab Delimited (TSV)   2D SDfile   Computed 3D by Vconf -m prep SDfile
Find this compound or compounds like it in BindingDB:
Activity Spreadsheet -- Enzyme Inhibition Constant Data from BindingDB
Found 2 hits for monomerid = 505530
TargetUbiquitin carboxyl-terminal hydrolase 30(Homo sapiens (Human))
Mission Therapeutics
US Patent
LigandPNGBDBM505530((3aR,6aR)-5-cyano-N-(5- phenyl-pyridin-2-yl) hexah...)
Affinity DataIC50: <100nM. Assay description: Dilution plates were prepared at 21 times the final concentration (2100 μM for a final concentration of 100 μM) in 50% DMSO in a 96-well po...
Ligand InfoPC cidPC sid
In DepthDetails US Patent
TargetUbiquitin carboxyl-terminal hydrolase 30(Homo sapiens (Human))
Mission Therapeutics
US Patent
LigandPNGBDBM505530((3aR,6aR)-5-cyano-N-(5- phenyl-pyridin-2-yl) hexah...)
Affinity DataIC50: <100nM. Assay description: USP30 biochemical fluorescence intensity IC50 assay Dilution plates were prepared at 21 times the final concentration (2100 μM for a final conce...
Ligand InfoPC cidPC sid
In DepthDetails US Patent