BDBM50561668 CHEMBL4764180
SMILES CNC(=O)c1csc2c(cc(nc12)N1CC(C1)OC(=O)NCC1CC1)C(F)(F)F
InChI Key InChIKey=MPHDQYYXVCEFMV-UHFFFAOYSA-N
Data  1 IC50
  Tab Delimited (TSV)   2D SDfile   Computed 3D by Vconf -m prep SDfile
Find this compound or compounds like it in BindingDB:
Activity Spreadsheet -- Enzyme Inhibition Constant Data from BindingDB
Found 1 hit for monomerid = 50561668
Target2-hydroxyacylsphingosine 1-beta-galactosyltransferase(Homo sapiens)
Sanofi R&D
Curated by ChEMBL
LigandPNGBDBM50561668(CHEMBL4764180)
Affinity DataIC50:  200nM. Assay description: Inhibition of UGT8 in human OE19 cells assessed as redcution in SFT accumulation measured after 72 hrs by LC-MS/MS analysis
Ligand InfoPC cidPC sid
In DepthDetails ArticlePubMed