BDBM50562257 CHEMBL4740210
SMILES COc1cc(\C=C2/SC(=O)NC2=O)ccc1COc1ccc(cc1)C(F)(F)F
InChI Key InChIKey=QWMCMTYHOHEFMD-SXGWCWSVSA-N
Data  1 KI  1 IC50
  Tab Delimited (TSV)   2D SDfile   Computed 3D by Vconf -m prep SDfile
Find this compound or compounds like it in BindingDB:
Activity Spreadsheet -- Enzyme Inhibition Constant Data from BindingDB
Found 2 hits for monomerid = 50562257
TargetForkhead box protein M1(Homo sapiens)
University Of Alberta
Curated by ChEMBL
LigandPNGBDBM50562257(CHEMBL4740210)
Affinity DataKi:  21nM. Assay description: Binding affinity to recombinant FOXM1 DBD (unknown origin) expressed in Escherichia coli BL21 (DE3) assessed as disruption of FOXM1-DNA complex prein...
Ligand InfoPC cidPC sid
In DepthDetails ArticlePubMed
TargetForkhead box protein M1(Homo sapiens)
University Of Alberta
Curated by ChEMBL
LigandPNGBDBM50562257(CHEMBL4740210)
Affinity DataIC50:  5.05E+4nM. Assay description: Binding affinity to recombinant FOXM1 DBD (unknown origin) expressed in Escherichia coli BL21 (DE3) assessed as disruption of FOXM1-DNA complex prein...
Ligand InfoPC cidPC sid
In DepthDetails ArticlePubMed