BDBM505765 4-(((R)-3-cyano-1-phenylpropyl)amino)- 6-(((S)-(1-cyclopropyl-1H-1,2,3-triazol- 4-yl)(6-(oxetan-3-yl)-4,5,6,7-tetrahydro- thieno[2,3-c]pyridin-3-yl)methyl)amino)- quinoline-3,8-dicarbonitrile::US11066414, Compound 414
SMILES N#CCC[C@@H](Nc1c(cnc2c(cc(N[C@H](C3=CN(NN3)C3CC3)c3csc4CN(CCc34)C3COC3)cc12)C#N)C#N)c1ccccc1
InChI Key InChIKey=USPKGFXPCYRSTI-JJQXXVEZSA-N
Data  1 IC50
  Tab Delimited (TSV)   2D SDfile   Computed 3D by Vconf -m prep SDfile
Find this compound or compounds like it in BindingDB:
Activity Spreadsheet -- Enzyme Inhibition Constant Data from BindingDB
Found 1 hit for monomerid = 505765
TargetEpidermal growth factor receptor(Homo sapiens (Human))
Gilead Sciences
US Patent
LigandPNGBDBM505765(4-(((R)-3-cyano-1-phenylpropyl)amino)- 6-(((S)-(1-...)
Affinity DataIC50:  1nM. Assay description: EGFR activity was measured using KinEASE (Cisbio), a time-resolved fluorescence resonance energy transfer (TR-FRET) immunoassay. In this assay, EGFR-...
Ligand InfoPC cidPC sid
In DepthDetails US Patent