BDBM505838 (S)-1-(4-(((3-cyano-8-fluoro-4-(neopentyl- amino)quinolin-6-yl)amino)(6-fluoro-2- methylpyridin-3-yl)methyl)- 1H-1,2,3-triazol- 1-yl)cyclobutane-1-carboxamide::US11066414, Compound 487
SMILES Cc1nc(F)ccc1[C@H](Nc1cc(F)c2ncc(C#N)c(NCC(C)(C)C)c2c1)C1=CN(NN1)C1(CCC1)C(N)=O
InChI Key InChIKey=AZOOZNFUOBPORY-SANMLTNESA-N
Data  1 IC50
  Tab Delimited (TSV)   2D SDfile   Computed 3D by Vconf -m prep SDfile
Find this compound or compounds like it in BindingDB:
Activity Spreadsheet -- Enzyme Inhibition Constant Data from BindingDB
Found 1 hit for monomerid = 505838
TargetEpidermal growth factor receptor(Homo sapiens (Human))
Gilead Sciences
US Patent
LigandPNGBDBM505838((S)-1-(4-(((3-cyano-8-fluoro-4-(neopentyl- amino)q...)
Affinity DataIC50:  1nM. Assay description: EGFR activity was measured using KinEASE (Cisbio), a time-resolved fluorescence resonance energy transfer (TR-FRET) immunoassay. In this assay, EGFR-...
Ligand InfoPC cidPC sid
In DepthDetails US Patent