BDBM506622 US11046646, Example 20
SMILES CCCCCCCCc1ccc(cc1)N1CCC(N)(COP(O)(O)=O)C1
InChI Key InChIKey=XTXTXVOLUPBNBI-UHFFFAOYSA-N
Data  2 EC50
  Tab Delimited (TSV)   2D SDfile   Computed 3D by Vconf -m prep SDfile
Find this compound or compounds like it in BindingDB:
Activity Spreadsheet -- Enzyme Inhibition Constant Data from BindingDB
Found 2 hits for monomerid = 506622
TargetSphingosine 1-phosphate receptor 3(Homo sapiens (Human))
Bristol-Myers Squibb
US Patent
LigandPNGBDBM506622(US11046646, Example 20)
Affinity DataEC50: >3.00E+4nM. Assay description: Compounds were loaded in a 384 Falcon v-bottom plate (0.5 μL/well in a 11 point, 3-fold dilution). Membranes prepared from S1P1/CHO cells or EDG...
Ligand InfoPC cidPC sid
In DepthDetails US Patent
TargetSphingosine 1-phosphate receptor 1(Homo sapiens (Human))
Bristol-Myers Squibb
US Patent
LigandPNGBDBM506622(US11046646, Example 20)
Affinity DataEC50:  384nM. Assay description: Membranes were prepared from CHO cells expressing human S1P1. Cells pellets (1×109 cells/pellet) were suspended in buffer containing 20 mM HEPES (4-(...
Ligand InfoPC cidPC sid
In DepthDetails US Patent