BDBM506760 4-(((1R,3s,5S,6r)-6-(1-(6- chloro-3H-imidazo[4,5- b]pyridin-2-yl)ethyl)- bicyclo[3.1.0]hexan-3- yl)oxy)-6-fluoroquinoline::US11046649, Ex. 138
SMILES CC([C@@H]1[C@H]2C[C@@H](C[C@@H]12)Oc1ccnc2ccc(F)cc12)c1nc2cc(Cl)cnc2[nH]1
InChI Key
Data  1 IC50
  Tab Delimited (TSV)   2D SDfile   Computed 3D by Vconf -m prep SDfile
Find this compound or compounds like it in BindingDB:
Activity Spreadsheet -- Enzyme Inhibition Constant Data from BindingDB
Found 1 hit for monomerid = 506760
TargetIndoleamine 2,3-dioxygenase 1(Homo sapiens (Human))
Board Of Regents, The University Of Texas System
US Patent
LigandPNGBDBM506760(4-(((1R,3s,5S,6r)-6-(1-(6- chloro-3H-imidazo[4,5- ...)
Affinity DataIC50:  1.70nM. Assay description: HeLa cells were obtained from the American Type Culture Collection (ATCC) and maintained in DMEM media containing 10% FBS. Cells (7,000/well) were se...
Ligand InfoPC cidPC sid
In DepthDetails US Patent