BDBM506762 N-(6-chloroimidazo[1,2-a]- pyridin-2-yl)-2- ((1R,3s,5S,6r)-3-((6-fluoro- quinolin-4-yl)oxy)bicyclo- [3.1.0]hexan-6- yl)butanamide::US11046649, Ex. 140
SMILES CCC([C@@H]1[C@H]2C[C@@H](C[C@@H]12)Oc1ccnc2ccc(F)cc12)C(=O)Nc1cn2cc(Cl)ccc2n1
InChI Key InChIKey=WTXMWJMRVIFMTH-CDWJIBGESA-N
Data  1 IC50
  Tab Delimited (TSV)   2D SDfile   Computed 3D by Vconf -m prep SDfile
Find this compound or compounds like it in BindingDB:
Activity Spreadsheet -- Enzyme Inhibition Constant Data from BindingDB
Found 1 hit for monomerid = 506762
TargetIndoleamine 2,3-dioxygenase 1(Homo sapiens (Human))
Board Of Regents, The University Of Texas System
US Patent
LigandPNGBDBM506762(N-(6-chloroimidazo[1,2-a]- pyridin-2-yl)-2- ((1R,3...)
Affinity DataIC50:  90nM. Assay description: HeLa cells were obtained from the American Type Culture Collection (ATCC) and maintained in DMEM media containing 10% FBS. Cells (7,000/well) were se...
Ligand InfoPC cidPC sid
In DepthDetails US Patent