BDBM506804 -(4-(2,7-dimethyldibenzo[b,f][1,4]oxazepin-11-yl)piperazin-1-yl)-2,2-dimethylpropanoic acid::US11046651, Compound A-3
SMILES Cc1ccc2N=C(C3CCN(CC(C)(C)C(O)=O)CC3)c3cc(C)ccc3Oc2c1
InChI Key InChIKey=BONSXLZOCJXKIV-UHFFFAOYSA-N
Data  2 KI
  Tab Delimited (TSV)   2D SDfile   Computed 3D by Vconf -m prep SDfile
Find this compound or compounds like it in BindingDB:
Activity Spreadsheet -- Enzyme Inhibition Constant Data from BindingDB
Found 2 hits for monomerid = 506804
Target5-hydroxytryptamine receptor 2C(Homo sapiens (Human))
Alairion
US Patent
LigandPNGBDBM506804(-(4-(2,7-dimethyldibenzo[b,f][1,4]oxazepin-11-yl)p...)
Affinity DataKi:  125nM. Assay description: 1 μL of a compound of the present disclosure the reference compound (Table J) was transferred to an assay plate. 1 μL of 0.2 mM SB-206533 w...
Ligand InfoPC cidPC sid
In DepthDetails US Patent
TargetD(2) dopamine receptor(Homo sapiens (Human))
Alairion
US Patent
LigandPNGBDBM506804(-(4-(2,7-dimethyldibenzo[b,f][1,4]oxazepin-11-yl)p...)
Affinity DataKi:  152nM. Assay description: 1 μL of a compound of the present disclosure and the reference compound (Table O) was transferred to an assay plate. 1 μL of droperidol was...
Ligand InfoPC cidPC sid
In DepthDetails US Patent