BDBM506948 US11046658, Example 102
SMILES Cc1ccc(cc1-c1cnc(N)c(n1)-c1cnc(s1)C1CC1)C(O)(CNC=O)C(F)(F)F
InChI Key InChIKey=PYMHQRXJTGYESX-UHFFFAOYSA-N
Data  2 IC50
  Tab Delimited (TSV)   2D SDfile   Computed 3D by Vconf -m prep SDfile
Find this compound or compounds like it in BindingDB:
Activity Spreadsheet -- Enzyme Inhibition Constant Data from BindingDB
Found 2 hits for monomerid = 506948
LigandPNGBDBM506948(US11046658, Example 102)
Affinity DataIC50: <100nM. Assay description: Materials: [γ-33P]ATP (10 mCi/mL) and Wheat Germ Agglutinin (WGA) YSi SPA Scintillation Beads was purchased from Perkin Elmer (Waltham, Mass.). ...
Ligand InfoKEGGPC cidPC sid
In DepthDetails US Patent
LigandPNGBDBM506948(US11046658, Example 102)
Affinity DataIC50: <100nM. Assay description: Materials: [γ-33P]ATP (10 mCi/mL) and Wheat Germ Agglutinin (WGA) YSi SPA Scintillation Beads was purchased from Perkin Elmer (Waltham, Mass.). ...
Ligand InfoKEGGPC cidPC sid
In DepthDetails US Patent