BDBM506981 4-hydroxy-N-methoxy-N-methyl-2- (thiophen-2-yl)-1,3-thiazole-5- carboxamide::US11046662, Compound 6
SMILES CON(C)C(=O)c1sc(nc1O)-c1cccs1
InChI Key InChIKey=LNDHJDDBDQIYMZ-UHFFFAOYSA-N
Data  1 IC50
  Tab Delimited (TSV)   2D SDfile   Computed 3D by Vconf -m prep SDfile
Find this compound or compounds like it in BindingDB:
Activity Spreadsheet -- Enzyme Inhibition Constant Data from BindingDB
Found 1 hit for monomerid = 506981
TargetTransient receptor potential cation channel subfamily M member 8(Homo sapiens (Human))
DompÉ
US Patent
LigandPNGBDBM506981(4-hydroxy-N-methoxy-N-methyl-2- (thiophen-2-yl)-1,...)
Affinity DataIC50:  156nM
Ligand InfoPC cidPC sid
In DepthDetails US Patent