BDBM506987 4-hydroxy-2-(2-hydroxyphenyl)-N- methoxy-N-methyl-1,3-thiazole-5- carboxamide::US11046662, Compound 12
SMILES CON(C)C(=O)c1sc(nc1O)-c1ccccc1O
InChI Key InChIKey=UFNWXHVCAXKDMI-UHFFFAOYSA-N
Data  1 IC50
  Tab Delimited (TSV)   2D SDfile   Computed 3D by Vconf -m prep SDfile
Find this compound or compounds like it in BindingDB:
Activity Spreadsheet -- Enzyme Inhibition Constant Data from BindingDB
Found 2 hits for monomerid = 506987
LigandPNGBDBM506987(4-hydroxy-2-(2-hydroxyphenyl)-N- methoxy-N-methyl-...)
Affinity DataIC50:  66nM
Ligand InfoPC cidPC sid
In DepthDetails
LigandPNGBDBM506987(4-hydroxy-2-(2-hydroxyphenyl)-N- methoxy-N-methyl-...)
Affinity DataIC50:  6nM
Ligand InfoPC cidPC sid
In DepthDetails US Patent