BDBM506997 1-[4-hydroxy-2-(thiophen-2-yl)-1,3- thiazol-5-yl]-3-methylbutan-1-one::US11046662, Compound 22
SMILES CC(C)CC(=O)c1sc(nc1O)-c1cccs1
InChI Key InChIKey=VSZLFAUMOGDGBH-UHFFFAOYSA-N
Data  1 IC50
  Tab Delimited (TSV)   2D SDfile   Computed 3D by Vconf -m prep SDfile
Find this compound or compounds like it in BindingDB:
Activity Spreadsheet -- Enzyme Inhibition Constant Data from BindingDB
Found 1 hit for monomerid = 506997
TargetTransient receptor potential cation channel subfamily M member 8(Homo sapiens (Human))
DompÉ
US Patent
LigandPNGBDBM506997(1-[4-hydroxy-2-(thiophen-2-yl)-1,3- thiazol-5-yl]-...)
Affinity DataIC50:  85nM
Ligand InfoPC cidPC sid
In DepthDetails US Patent