BDBM507000 1-[4-hydroxy-2-(pyridin-3-yl)-1,3- thiazol-5-yl]propan-1-one::US11046662, Compound 25
SMILES CCC(=O)c1sc(nc1O)-c1cccnc1
InChI Key InChIKey=MOLPNEOHUNSUQS-UHFFFAOYSA-N
Data  1 IC50
  Tab Delimited (TSV)   2D SDfile   Computed 3D by Vconf -m prep SDfile
Find this compound or compounds like it in BindingDB:
Activity Spreadsheet -- Enzyme Inhibition Constant Data from BindingDB
Found 1 hit for monomerid = 507000
TargetTransient receptor potential cation channel subfamily M member 8(Homo sapiens (Human))
DompÉ
US Patent
LigandPNGBDBM507000(1-[4-hydroxy-2-(pyridin-3-yl)-1,3- thiazol-5-yl]pr...)
Affinity DataIC50:  356nM
Ligand InfoPC cidPC sid
In DepthDetails US Patent