BDBM507007 1-[2-(3-aminophenyl)-4-hydroxy-1,3- thiazol-5-yl]propan-1-one::US11046662, Compound 32
SMILES CCC(=O)c1sc(nc1O)-c1cccc(N)c1
InChI Key InChIKey=XJCQCJRIQZHEEX-UHFFFAOYSA-N
Data  1 IC50
  Tab Delimited (TSV)   2D SDfile   Computed 3D by Vconf -m prep SDfile
Find this compound or compounds like it in BindingDB:
Activity Spreadsheet -- Enzyme Inhibition Constant Data from BindingDB
Found 1 hit for monomerid = 507007
TargetTransient receptor potential cation channel subfamily M member 8(Homo sapiens (Human))
DompÉ
US Patent
LigandPNGBDBM507007(1-[2-(3-aminophenyl)-4-hydroxy-1,3- thiazol-5-yl]p...)
Affinity DataIC50:  450nM
Ligand InfoPC cidPC sid
In DepthDetails US Patent