BDBM507049 2-Amino-8-(5-fluoro-1,4-dihydroquinazolin-2-yl)-N,N-dipropyl-3H-1-benzazepine-4-carboxamide::US11046671, Example 10
SMILES CCCN(CCC)C(=O)C1=Cc2ccc(cc2N=C(N)C1)C1=NCc2c(F)cccc2N1
InChI Key InChIKey=YYSOVNIHXSYWTP-UHFFFAOYSA-N
Data  2 EC50
  Tab Delimited (TSV)   2D SDfile   Computed 3D by Vconf -m prep SDfile
Find this compound or compounds like it in BindingDB:
Activity Spreadsheet -- Enzyme Inhibition Constant Data from BindingDB
Found 2 hits for monomerid = 507049
TargetToll-like receptor 7(Homo sapiens (Human))
Hoffmann-La Roche
US Patent
LigandPNGBDBM507049(2-Amino-8-(5-fluoro-1,4-dihydroquinazolin-2-yl)-N,...)
Affinity DataEC50: >1.00E+5nM. Assay description: For TLR8 and TLR7 activity testing, HEK-Blue human TLR8 or TLR7 cells (Invivogen, San Diego, Calif., USA) are used, respectively. These cells are des...
Ligand InfoPC cidPC sid
In DepthDetails US Patent
TargetToll-like receptor 8(Homo sapiens (Human))
Hoffmann-La Roche
US Patent
LigandPNGBDBM507049(2-Amino-8-(5-fluoro-1,4-dihydroquinazolin-2-yl)-N,...)
Affinity DataEC50:  3nM. Assay description: For TLR8 and TLR7 activity testing, HEK-Blue human TLR8 or TLR7 cells (Invivogen, San Diego, Calif., USA) are used, respectively. These cells are des...
Ligand InfoPC cidPC sid
In DepthDetails US Patent